{"text_format":"1","workbook":"xlsx","n_sheets":11,"sheets":["Blad1","FrontPage","Introduction","TMMi Level 2","TMMi Level 3","Result","Recommendations","Multilan","TMMi Level 2 (copy)","TMMi Level 3 (copy)","Hulptabellen"],"not_rendered":{"charts":0,"images":3,"macros":1,"external_links":0,"defined_names":9,"comments":0,"pivot_tables":0},"unopened":[],"bounds":{"document_bytes":16777216,"sheet_cells":100000,"rows_first":2000,"rows_last":500,"rows_between":2000,"halvings":0,"cell_chars":16384,"cell_head_chars":4096},"cells_cut":0,"cells_raw":0,"read":"whole","date_system":"1900"}

{"sheet":"Blad1","index":0,"n_rows":4,"n_cols":3,"rows_kept":4,"cut":false,"hidden":false,"merged":[]}
[]
[]
[]
[null,null,"Please Enable Macro's for using this tool"]

{"sheet":"FrontPage","index":1,"n_rows":0,"n_cols":0,"rows_kept":0,"cut":false,"hidden":true,"merged":[]}

{"sheet":"Introduction","index":2,"n_rows":40,"n_cols":12,"rows_kept":40,"cut":false,"hidden":true,"merged":[[22,1,22,10],[28,1,28,8],[29,1,29,8],[19,2,19,11],[14,2,14,6],[15,2,15,6],[16,2,16,6],[17,2,17,6],[18,2,18,6]]}
[]
[null," Test Maturity Model integration (TMMi®)"]
[null,{"$f":"UPPER(\" Lightning scan tool\")","v":" LIGHTNING SCAN TOOL"}]
[null," TMMi Foundation, v2.5"]
[]
[null,{"$f":"HLOOKUP(L15,Multilan!A1:P1000,2)","v":"TMMi lightning scan tool"}]
[null,{"$f":"HLOOKUP(L15,Multilan!A1:P1000,3)","v":"The TMMi lightning scan tool has been developed to support an understanding of the TMMi and thereby make the TMMi model more tangible."}]
[null,{"$f":"HLOOKUP(L15,Multilan!A1:P1000,4)","v":"It will provide interested parties with a quick evaluation of their test maturity based on the TMMi model."}]
{"$rows_left_out":33}
{"sheet":"TMMi Level 2","index":3,"n_rows":33,"n_cols":3,"rows_kept":33,"cut":false,"hidden":true,"merged":[]}
[]
[null,null,"Partly"]
[null,{"$f":"HLOOKUP(Introduction!L15,Multilan!A1:P1000,35)","v":" TMMi Level 2 Managed "},"No"]
[null,{"$f":"HLOOKUP(Introduction!L15,Multilan!A1:P1000,36)","v":"Process area 2.1 Test Policy and Strategy "},"Yes"]
[null,{"$f":"HLOOKUP(Introduction!L15,Multilan!A1:P1000,37)","v":"A documented test policy exists and has been approved by management. "}]
[null,{"$f":"HLOOKUP(Introduction!L15,Multilan!A1:P1000,38)","v":"A test strategy is defined, stating the goals, activities, deliverables and responsibilities for each test level, test type or test quadrant."}]
[null,{"$f":"HLOOKUP(Introduction!L15,Multilan!A1:P1000,39)","v":"The test and software engineers are informed on the test policy and defined test strategy and the documents are distributed to all stakeholders. "}]
[null,{"$f":"HLOOKUP(Introduction!L15,Multilan!A1:P1000,40)","v":"A basic set of test performance indicators is defined and deployed. "}]
{"$rows_left_out":26}
{"sheet":"TMMi Level 3","index":4,"n_rows":33,"n_cols":3,"rows_kept":33,"cut":false,"hidden":true,"merged":[]}
[]
[null,null,"Partly"]
[null,{"$f":"HLOOKUP(Introduction!L15,Multilan!A1:P1000,66)","v":" TMMi Level 3 Defined "},"No"]
[null,{"$f":"HLOOKUP(Introduction!L15,Multilan!A1:P1000,67)","v":"Process area 3.1 Test Organization "},"Yes"]
[null,{"$f":"HLOOKUP(Introduction!L15,Multilan!A1:P1000,68)","v":"A test organization, which supports the testing practices in projects and the organization, is defined and established. "}]
[null,{"$f":"HLOOKUP(Introduction!L15,Multilan!A1:P1000,69)","v":"Test functions with accompanying job descriptions are established and assigned to the test specialists. "}]
[null,{"$f":"HLOOKUP(Introduction!L15,Multilan!A1:P1000,70)","v":"Test career paths are established that allow testers to improve their knowledge, skills, status and rewards, and are used as a basis for personal development plans. "}]
[null,{"$f":"HLOOKUP(Introduction!L15,Multilan!A1:P1000,71)","v":"The organization’s test processes are periodically assessed, e.g., by conducting retrospectives, to identify strengths, weaknesses and improvement opportunities. Process changes that address the improvements are planned and implemented. "}]
{"$rows_left_out":26}
{"sheet":"Result","index":5,"n_rows":32,"n_cols":22,"rows_kept":32,"cut":false,"hidden":true,"merged":[]}
[]
[null,{"$f":"HLOOKUP(Introduction!L15,Multilan!A1:P1000,97)","v":"Conclusion"}]
[]
[null,{"$f":"IF(Hulptabellen!B67=\"L1\",HLOOKUP(Introduction!L15,Multilan!A1:P1000,171),IF(Hulptabellen!B67=\"L2\",HLOOKUP(Introduction!L15,Multilan!A1:P1000,170),IF(Hulptabellen!B67=\"L3\",HLOOKUP(Introduction!L15,Multilan!A1:P1000,173))))","v":"The TMMi lightning scan indicates that you are at level TMMi Level 1 Initial."}]
[]
[]
[null,{"$f":"HLOOKUP(Introduction!L15,Multilan!A1:P1000,23)","v":"TMMi Level 2 Managed"},0.1,0.2,0.3,0.4,0.5,0.6,0.7,0.8,0.9,1,null,{"$f":"HLOOKUP(Introduction!L15,Multilan!A1:P1000,108)","v":"Result"},null,null,null,null,null,null,null," "]
[null,{"$f":"HLOOKUP(Introduction!L15,Multilan!A1:P1000,24)","v":"PA 2.1 Test Policy and Strategy"},{"$f":"IF(Introduction!E33=\"not Applicable\",\"na\",IF(COUNTIF('TMMi Level 2'!$C$5:$C$9,\"partly\")+(COUNTIF('TMMi Level 2'!$C$5:$C$9,\"yes\")*2)>=1,COUNTIF('TMMi Level 2'!$C$5:$C$9,\"partly\")+(COUNTIF('TMMi Level 2'!$C$5:$C$9,\"yes\")*2),\"\"))","v":""},{"$f":"IF(Introduction!E33=\"not Applicable\",\"na\",IF(COUNTIF('TMMi Level 2'!$C$5:$C$9,\"partly\")+(COUNTIF('TMMi Level 2'!$C$5:$C$9,\"yes\")*2)>=2,COUNTIF('TMMi Level 2'!$C$5:$C$9,\"partly\")+(COUNTIF('TMMi Level 2'!$C$5:$C$9,\"yes\")*2),\"\"))","v":""},{"$f":"IF(Introduction!E33=\"not Applicable\",\"na\",IF(COUNTIF('TMMi Level 2'!$C$5:$C$9,\"partly\")+(COUNTIF('TMMi Level 2'!$C$5:$C$9,\"yes\")*2)>=3,COUNTIF('TMMi Level 2'!$C$5:$C$9,\"partly\")+(COUNTIF('TMMi Level 2'!$C$5:$C$9,\"yes\")*2),\"\"))","v":""},{"$f":"IF(Introduction!E33=\"not Applicable\",\"na\",IF(COUNTIF('TMMi Level 2'!$C$5:$C$9,\"partly\")+(COUNTIF('TMMi Level 2'!$C$5:$C$9,\"yes\")*2)>=4,COUNTIF('TMMi Level 2'!$C$5:$C$9,\"partly\")+(COUNTIF('TMMi Level 2'!$C$5:$C$9,\"yes\")*2),\"\"))","v":""},{"$f":"IF(Introduction!E33=\"not Applicable\",\"na\",IF(COUNTIF('TMMi Level 2'!$C$5:$C$9,\"partly\")+(COUNTIF('TMMi Level 2'!$C$5:$C$9,\"yes\")*2)>=5,COUNTIF('TMMi Level 2'!$C$5:$C$9,\"partly\")+(COUNTIF('TMMi Level 2'!$C$5:$C$9,\"yes\")*2),\"\"))","v":""},{"$f":"IF(Introduction!E33=\"not Applicable\",\"na\",IF(COUNTIF('TMMi Level 2'!$C$5:$C$9,\"partly\")+(COUNTIF('TMMi Level 2'!$C$5:$C$9,\"yes\")*2)>=6,COUNTIF('TMMi Level 2'!$C$5:$C$9,\"partly\")+(COUNTIF('TMMi Level 2'!$C$5:$C$9,\"yes\")*2),\"\"))","v":""},{"$f":"IF(Introduction!E33=\"not Applicable\",\"na\",IF(COUNTIF('TMMi Level 2'!$C$5:$C$9,\"partly\")+(COUNTIF('TMMi Level 2'!$C$5:$C$9,\"yes\")*2)>=7,COUNTIF('TMMi Level 2'!$C$5:$C$9,\"partly\")+(COUNTIF('TMMi Level 2'!$C$5:$C$9,\"yes\")*2),\"\"))","v":""},{"$f":"IF(Introduction!E33=\"not Applicable\",\"na\",IF(COUNTIF('TMMi Level 2'!$C$5:$C$9,\"partly\")+(COUNTIF('TMMi Level 2'!$C$5:$C$9,\"yes\")*2)>=8,COUNTIF('TMMi Level 2'!$C$5:$C$9,\"partly\")+(COUNTIF('TMMi Level 2'!$C$5:$C$9,\"yes\")*2),\"\"))","v":""},{"$f":"IF(Introduction!E33=\"not Applicable\",\"na\",IF(COUNTIF('TMMi Level 2'!$C$5:$C$9,\"partly\")+(COUNTIF('TMMi Level 2'!$C$5:$C$9,\"yes\")*2)>=9,COUNTIF('TMMi Level 2'!$C$5:$C$9,\"partly\")+(COUNTIF('TMMi Level 2'!$C$5:$C$9,\"yes\")*2),\"\"))","v":""},{"$f":"IF(Introduction!E33=\"not Applicable\",\"na\",IF(COUNTIF('TMMi Level 2'!$C$5:$C$9,\"partly\")+(COUNTIF('TMMi Level 2'!$C$5:$C$9,\"yes\")*2)>=10,COUNTIF('TMMi Level 2'!$C$5:$C$9,\"partly\")+(COUNTIF('TMMi Level 2'!$C$5:$C$9,\"yes\")*2),\"\"))","v":""},null,{"$f":"IF(C8=\"na\",HLOOKUP(Introduction!L15,Multilan!A1:P1000,166),IF(COUNTIF('TMMi Level 2'!$C$5:$C$9,\"partly\")+(COUNTIF('TMMi Level 2'!$C$5:$C$9,\"yes\")*2)>=9,HLOOKUP(Introduction!L15,Multilan!A1:P1000,107),IF(COUNTIF('TMMi Level 2'!$C$5:$C$9,\"partly\")+(COUNTIF('TMMi Level 2'!$C$5:$C$9,\"yes\")*2)>5,HLOOKUP(Introduction!L15,Multilan!A1:P1000,106),IF(COUNTIF('TMMi Level 2'!$C$5:$C$9,\"partly\")+(COUNTIF('TMMi Level 2'!$C$5:$C$9,\"yes\")*2)>=2,HLOOKUP(Introduction!L15,Multilan!A1:P1000,105),HLOOKUP(Introduction!L15,Multilan!A1:P1000,104)))))","v":"Not Achieved"}]
{"$rows_left_out":25}
{"sheet":"Recommendations","index":6,"n_rows":56,"n_cols":3,"rows_kept":56,"cut":false,"hidden":true,"merged":[[40,2,40,11],[45,2,45,11],[50,2,50,11],[55,2,55,11],[9,2,9,11],[14,2,14,11],[19,2,19,11],[24,2,24,11],[29,2,29,11],[35,2,35,11]]}
[]
[]
[null,{"$f":"HLOOKUP(Introduction!L15,Multilan!A1:P1000,112)","v":"Recommendations"}]
[]
[]
[null,{"$f":"HLOOKUP(Introduction!L15,Multilan!A1:P1000,113)","v":" Details TMMi Level 2 Managed "}]
[null,{"$f":"HLOOKUP(Introduction!L15,Multilan!A1:P1000,24)","v":"PA 2.1 Test Policy and Strategy"}]
[]
{"$rows_left_out":49}
{"sheet":"Multilan","index":7,"n_rows":175,"n_cols":11,"rows_kept":175,"cut":false,"hidden":true,"merged":[]}
[null,"Chinese","English","French","German","Italiano","Japanese","Nederlands","Polish","Spanish","Türkçe"]
[1,"TMMi 快速扫描工具","TMMi lightning scan tool","Outil d'évaluation TMMi éclair","TMMi-Blitzscan-Tool","TMMi lightning scan tool","TMMiライトニングスキャンツール","TMMi lightning scantool","Narzędzie TMMi Lightning Scan","Herramienta de análisis light de TMMi","TMMi hızlı tarama aracı"]
[2,"TMMi快速扫描工具的开发旨在更好的支持您对TMMi的理解，从而使TMMi模型更加具体和实用。","The TMMi lightning scan tool has been developed to support an understanding of the TMMi and thereby make the TMMi model more tangible.","L’outil d'évaluation TMMi éclair a été développé pour faciliter la compréhension de TMMi et ainsi rendre le modèle TMMi plus tangible.","Das TMMi-Blitzscan-Tool wurde entwickelt, um das Verständnis für TMMi zu fördern und das TMMi-Modell greifbarer zu machen.","Il TMMi lightning scan tool è stato sviluppato per supportare la comprensione del TMMi e quindi rendere il modello TMMi più tangibile.","TMMi ライトニング スキャン ツールは、TMMi の理解をサポートし、TMMi モデルをより具体的なものにするために開発されました。","De TMMi lightning scantool is ontwikkeld om het begrip van TMMi te ondersteunen en zo het TMMi-model tastbaarder te maken.","Narzędzie TMMi Lightning Scan zostało opracowane, aby wspierać zrozumienie modelu TMMi i tym samym uczynić go bardziej przystępnym.","La herramienta de análisis light de TMMii se ha desarrollado para apoyar la comprensión del TMMi y, por lo tanto, hacer que el modelo TMMi sea más tangible.","TMMi hızlı tarama aracı, TMMi'nin anlaşılmasını desteklemek ve böylece TMMi modelini daha somut hale getirmek için geliştirilmiştir."]
[3,"它将为感兴趣的各方提供一个基于TMMi模型的测试成熟度的快速评估。","It will provide interested parties with a quick evaluation of their test maturity based on the TMMi model.","Il fournira aux parties intéressées une évaluation rapide de la maturité de leur test basée sur le modèle TMMi.","Es wird interessierten Parteien eine schnelle Bewertung ihrer Testreife auf der Grundlage des TMMi-Modells ermöglichen.","Fornirà alle parti interessate una rapida valutazione della loro maturità di test basata sul modello TMMi.","これにより、関係者は TMMi モデルに基づいてテストの成熟度を迅速に評価できます。","Het biedt geïnteresseerde partijen een snelle evaluatie van hun testvolwassenheid op basis van het TMMi-model.","Narzędzie umożliwia zainteresowanym szybkie oszacowanie dojrzałości testów na podstawie modelu TMMi.","Proporciona a los interesados una evaluación rápida, de la madurez del proceso de pruebas, en base al modelo TMMi.","Bu, ilgili tarafların, TMMi modelini baz alarak test olgunluklarını hızlı bir şekilde değerlendirmelerini sağlayacaktır."]
[4,"当然，快速扫描无法与通常通过非正式或正式TMMi评估实现的严格程度相比。","Of course the lightning scan does not compare to the level of rigor that is typically achieved through informal of formal TMMi assessments.","Bien sûr, l'évaluation éclair ne se compare pas au niveau de rigueur généralement atteint par des évaluations TMMi informelles ou formelles.","Natürlich ist der Blitzscan nicht mit der Rigorosität zu vergleichen, die normalerweise durch formelle TMMi-Bewertungen erreicht wird.","Ovviamente il lightning scan non è paragonabile al livello di rigore che viene tipicamente raggiunto attraverso assessment informali o formali TMMi.","もちろん、ライトニングスキャンは、非公式または公式なTMMiアセスメントによって達成される厳密さと比較するものではありません。","Natuurlijk is de lightning scan niet te vergelijken met het niveau van nauwkeurigheid dat doorgaans wordt bereikt door informele TMMi-beoordelingen.","Oczywiście Lightning Scan nie dorównuje poziomowi rygoru, który zwykle osiąga się podczas nieformalnych lub formalnych ocen zgodnych z TMMi.","Por supuesto, el análisis light no es comparable con el nivel de rigor que generalmente se logra a través de evaluaciones informales o formales de TMMi.","Elbette hızlı tarama, resmi veya gayri resmi TMMi denetimleriyle elde edilen detay düzeyiyle karşılaştırılmamalıdır."]
[5,"今天，TMMi已成为测试过程改进的事实上的世界标准。有关TMMi的更多信息，请访问www.TMMi.org。","Today TMMi is the de facto world standard for test process improvement. More information on TMMi can be found at www.TMMi.org.","Actuellement, TMMi est la norme mondiale de facto pour l’amélioration des processus de test. Vous trouverez plus d’informations sur TMMi à www.TMMi.org.","Heute ist TMMi das weltweite De-facto-Standardprozessmodell für die Verbesserung von Testprozessen. Weitere Informationen über TMMi finden Sie unter www.TMMi.org.","Oggi TMMi è de facto lo standard mondiale per il miglioramento del processo di test. Ulteriori informazioni su TMMi possono essere trovate su www.TMMi.org.","現在、TMMi はテストプロセス改善の事実上の世界標準となっています。 TMMi の詳細については、www.TMMi.org をご覧ください。","Vandaag de dag is TMMi de de facto wereldstandaard voor testprocesverbetering. Meer informatie over TMMi is te vinden op www.TMMi.org.","Obecnie TMMi jest światowym standardem de facto w zakresie doskonalenia procesów testowych. Więcej informacji na temat TMMi można znaleźć na stronie www.TMMi.org.","Hoy en día, TMMi es el estándar mundial de facto para la mejora de procesos de prueba. Puede encontrar más información sobre TMMi se puede consultar www.TMMi.org.","Günümüzde TMMi, test süreci iyileştirme için kabul edilen fiili dünya standartıdır. TMMi hakkında daha fazla bilgiye www.tmmi.org adresinden ulaşabilirsiniz."]
[6,"介绍","Introduction","Introduction","Einführung","Introduzione","はじめに","Inleiding","Wprowadzenie","Introducción","Giriş"]
[7,"用户信息","User information","Informations utilisateur","Informationen für den Benutzer","Informazioni dell'utente","ユーザー情報","Gebruiker Informatie","Informacje dla użytkownika","Información para el usuario","Kullanıcı bilgileri"]
{"$rows_left_out":168}
{"sheet":"TMMi Level 2 (copy)","index":8,"n_rows":68,"n_cols":3,"rows_kept":68,"cut":false,"hidden":true,"merged":[]}
[null,{"$f":"HLOOKUP(Introduction!L15,Multilan!A1:P1000,174)","v":"Findings"}]
[null,null,"Partly"]
[null,{"$f":"HLOOKUP(Introduction!L15,Multilan!A1:P1000,35)","v":" TMMi Level 2 Managed "},"No"]
[null,{"$f":"HLOOKUP(Introduction!L15,Multilan!A1:P1000,36)","v":"Process area 2.1 Test Policy and Strategy "}]
[null,{"$f":"HLOOKUP(Introduction!L15,Multilan!A1:P1000,37)","v":"A documented test policy exists and has been approved by management. "},{"$f":"IF('TMMi Level 2'!C5=\"\",\"\",'TMMi Level 2'!C5)","v":""}]
[null,{"$f":"HLOOKUP(Introduction!L15,Multilan!A1:P1000,38)","v":"A test strategy is defined, stating the goals, activities, deliverables and responsibilities for each test level, test type or test quadrant."},{"$f":"IF('TMMi Level 2'!C6=\"\",\"\",'TMMi Level 2'!C6)","v":""}]
[null,{"$f":"HLOOKUP(Introduction!L15,Multilan!A1:P1000,39)","v":"The test and software engineers are informed on the test policy and defined test strategy and the documents are distributed to all stakeholders. "},{"$f":"IF('TMMi Level 2'!C7=\"\",\"\",'TMMi Level 2'!C7)","v":""}]
[null,{"$f":"HLOOKUP(Introduction!L15,Multilan!A1:P1000,40)","v":"A basic set of test performance indicators is defined and deployed. "},{"$f":"IF('TMMi Level 2'!C8=\"\",\"\",'TMMi Level 2'!C8)","v":""}]
{"$rows_left_out":61}
{"sheet":"TMMi Level 3 (copy)","index":9,"n_rows":33,"n_cols":3,"rows_kept":33,"cut":false,"hidden":true,"merged":[]}
[]
[null,null,"Partly"]
[null," TMMi Level 3 Defined ","No"]
[null,"Process area 3.1 Test Organization ","Yes"]
[null,"A test organization, which supports the testing practices in projects and the organization, is defined and established. ",{"$f":"IF('TMMi Level 3'!C5=\"\",\"\",'TMMi Level 3'!C5)","v":""}]
[null,"Test functions with accompanying job descriptions are established and assigned to the test specialists. ",{"$f":"IF('TMMi Level 3'!C6=\"\",\"\",'TMMi Level 3'!C6)","v":""}]
[null,"Test career paths are established that allow testers to improve their knowledge, skills, status and rewards, and are used as a basis for personal development plans. ",{"$f":"IF('TMMi Level 3'!C7=\"\",\"\",'TMMi Level 3'!C7)","v":""}]
[null,"The organization’s test processes are periodically assessed, e.g., by conducting retrospectives, to identify strengths, weaknesses and improvement opportunities. Process changes that address the improvements are planned and implemented. ",{"$f":"IF('TMMi Level 3'!C8=\"\",\"\",'TMMi Level 3'!C8)","v":""}]
{"$rows_left_out":26}
{"sheet":"Hulptabellen","index":10,"n_rows":67,"n_cols":11,"rows_kept":67,"cut":false,"hidden":true,"merged":[]}
["no","Applicable",null,null,null,null,"No","Yes","Com No","Comb Yes","Languageline"]
["partly","Not Applicable",null,{"$f":"HLOOKUP(Introduction!L15,Multilan!A1:P1000,24)","v":"PA 2.1 Test Policy and Strategy"},{"$f":"HLOOKUP(Introduction!$L$15,Multilan!$A$1:$P$1000,K2)","v":"- Definition of Test Policy"},{"$f":"'TMMi Level 2'!C5","v":0},{"$f":"IF(F2=\"no\",E2 & CHAR(10),IF(F2=\"partly\",E2 & CHAR(10),\"\"))","v":""},{"$f":"IF(F2=\"yes\",E2 & CHAR(10),\"\")","v":""},{"$f":"CONCATENATE(G2,G3,G4,G5,G6)","v":""},{"$f":"CONCATENATE(H2,H3,H4,H5,H6)","v":""},115]
["yes",null,null,null,{"$f":"HLOOKUP(Introduction!$L$15,Multilan!$A$1:$P$1000,K3)","v":"- Definition of Test Strategy"},{"$f":"'TMMi Level 2'!C6","v":0},"",{"$f":"IF(F3=\"yes\",E3 & CHAR(10),\"\")","v":""},null,null,116]
[null,null,null,null,{"$f":"HLOOKUP(Introduction!$L$15,Multilan!$A$1:$P$1000,K4)","v":"- Distribution of test policy and test strategy to \n   stakeholders"},{"$f":"'TMMi Level 2'!C7","v":0},"",{"$f":"IF(F4=\"yes\",E4 & CHAR(10),\"\")","v":""},null,null,117]
[null,null,null,null,{"$f":"HLOOKUP(Introduction!$L$15,Multilan!$A$1:$P$1000,K5)","v":"- Definition and deployment of performance indicators"},{"$f":"'TMMi Level 2'!C8","v":0},"",{"$f":"IF(F5=\"yes\",E5 & CHAR(10),\"\")","v":""},null,null,118]
[null,null,null,null,{"$f":"HLOOKUP(Introduction!$L$15,Multilan!$A$1:$P$1000,K6)","v":"- Link from test policy and performance indicators to \n   business objectives"},{"$f":"'TMMi Level 2'!C9","v":0},"",{"$f":"IF(F6=\"yes\",E6 & CHAR(10),\"\")","v":""},null,null,119]
[null,null,null,{"$f":"HLOOKUP(Introduction!L15,Multilan!A1:P1000,25)","v":"PA 2.2 Test Planning"},{"$f":"HLOOKUP(Introduction!$L$15,Multilan!$A$1:$P$1000,K7)","v":"- Applying a product risk assessment"},{"$f":"'TMMi Level 2'!C11","v":0},"",{"$f":"IF(F7=\"yes\",E7  & CHAR(10),\"\")","v":""},{"$f":"CONCATENATE(G7,G8,G9,G10,G11)","v":""},{"$f":"CONCATENATE(H7,H8,H9,H10,H11)","v":""},120]
[null,null,null,null,{"$f":"HLOOKUP(Introduction!$L$15,Multilan!$A$1:$P$1000,K8)","v":"- Defining a differentiated risk-based test approach"},{"$f":"'TMMi Level 2'!C12","v":0},"",{"$f":"IF(F8=\"yes\",E8  & CHAR(10),\"\")","v":""},null,null,121]
{"$rows_left_out":59}